Parece que no puedo ejecutar playn-showcase-android en eclipse

Actualmente estoy tratando de configurar playn en eclipse para hacer un juego en Android. Seguí los pasos de instalación aquí: http://0-code.google.com.precise.petronas.com.my/p/playn/wiki/GettingStarted

Instalé las cosas de desarrollo de Android y el complemento nativo de Maven e incluso hice todos los pasos específicos de Android, incluida la adición de una instalación de Maven que es compatible con el complemento de Android Maven (en mi caso, fue Maven 3.0.4).

Importé los archivos de muestra e intenté ejecutar Playn Showcase para Android y esto es lo que obtuve:

[INFO] Scanning for projects...
[INFO]                                                                         
[INFO] ------------------------------------------------------------------------
[INFO] Building PlayN Showcase Android 1.0-SNAPSHOT
[INFO] ------------------------------------------------------------------------
    Downloading: http://snapshots.repository.codehaus.org/org/apache/maven/plugins/maven-install-plugin/maven-metadata.xml
Downloading: http://snapshots.repository.codehaus.org/org/apache/maven/plugins/maven-resources-plugin/maven-metadata.xml
Downloading: http://snapshots.repository.codehaus.org/org/apache/maven/plugins/maven-surefire-plugin/maven-metadata.xml
Downloading: http://snapshots.repository.codehaus.org/org/apache/maven/plugins/maven-jar-plugin/maven-metadata.xml
Downloading: http://snapshots.repository.codehaus.org/org/apache/maven/plugins/maven-deploy-plugin/maven-metadata.xml
Downloading: http://forplay.googlecode.com/svn/mavenrepo/com/googlecode/playn/playn-showcase-core/1.0-SNAPSHOT/maven-metadata.xml
Downloading: https://oss.sonatype.org/content/repositories/snapshots/com/googlecode/playn/playn-showcase-core/1.0-SNAPSHOT/maven-metadata.xml
Downloading: http://forplay.googlecode.com/svn/mavenrepo/com/googlecode/playn/playn-showcase-core/1.0-SNAPSHOT/playn-showcase-core-1.0-SNAPSHOT.pom
Downloading: https://oss.sonatype.org/content/repositories/snapshots/com/googlecode/playn/playn-showcase-core/1.0-SNAPSHOT/playn-showcase-core-1.0-SNAPSHOT.pom
[WARNING] The POM for com.googlecode.playn:playn-showcase-core:jar:1.0-SNAPSHOT is missing, no dependency information available
Downloading: http://forplay.googlecode.com/svn/mavenrepo/com/googlecode/playn/playn-showcase-core/1.0-SNAPSHOT/playn-showcase-core-1.0-SNAPSHOT.jar
Downloading: https://oss.sonatype.org/content/repositories/snapshots/com/googlecode/playn/playn-showcase-core/1.0-SNAPSHOT/playn-showcase-core-1.0-SNAPSHOT.jar
[INFO] ------------------------------------------------------------------------
[INFO] BUILD FAILURE
[INFO] ------------------------------------------------------------------------
[INFO] Total time: 6.687s
[INFO] Finished at: Tue Jun 12 00:05:36 PDT 2012
[INFO] Final Memory: 10M/109M
[INFO] ------------------------------------------------------------------------
[ERROR] Failed to execute goal on project playn-showcase-android: Could not resolve dependencies for project com.googlecode.playn:playn-showcase-android:apk:1.0-SNAPSHOT: Could not find artifact com.googlecode.playn:playn-showcase-core:jar:1.0-SNAPSHOT in forplay-legacy (http://forplay.googlecode.com/svn/mavenrepo) -> [Help 1]
[ERROR] 
[ERROR] To see the full stack trace of the errors, re-run Maven with the -e switch.
[ERROR] Re-run Maven using the -X switch to enable full debug logging.
[ERROR] 
[ERROR] For more information about the errors and possible solutions, please read the following articles:
[ERROR] [Help 1] http://cwiki.apache.org/confluence/display/MAVEN/DependencyResolutionException

Así que aparentemente me falta un POM para com.googlecode.playn:playn-showcase-core:jar:1.0-SNAPSHOT. ¿Cómo resuelvo este problema?

preguntado el 12 de junio de 12 a las 08:06

Tengo el mismo problema con la versión regular de Java y seguí los pasos exactamente. -

Por cierto, esto solo me sucede de eclipse. Desde la línea de comando, puedo ejecutar bien yendo a la carpeta playn-samples/showcase y haciendo mvn3 -Phtml Integration-test -

2 Respuestas

Intente ejecutar el comando Maven desde el directorio superior de su proyecto en lugar de algún subdirectorio. Lea esto en alguna parte. Maven parece ser estúpido. Para mí lo hizo funcionar.

Respondido el 16 de junio de 12 a las 19:06

Está bien. Después de escribir el último comentario sobre su pregunta, descubrí la solución:

  • Haga clic derecho en playn-showcase: Ejecutar como -> Compilación experta...
  • En el conjunto de ventanas Editar configuración:
    • Objetivos: Prueba de Integración
    • Perfiles: androide

Estaba teniendo un problema para compilar html, pero el error que recibí fue el mismo, por lo que en mi caso, la solución fue establecer html en Perfiles.

Respondido 27 Jul 12, 15:07

No es la respuesta que estás buscando? Examinar otras preguntas etiquetadas or haz tu propia pregunta.